Skip to content

Merge branch 'main' into convert-unsafe

Azure Pipelines / runtime failed Apr 22, 2024 in 1h 38m 51s

Build #20240418.59 had test failures

Details

Tests

  • Failed: 28 (0.00%)
  • Passed: 7,135,912 (98.35%)
  • Other: 119,873 (1.65%)
  • Total: 7,255,813

Annotations

Check failure on line 44 in .packages/microsoft.dotnet.helix.sdk/9.0.0-beta.24217.1/tools/azure-pipelines/AzurePipelines.MultiQueue.targets

See this annotation in the file changed.

@azure-pipelines azure-pipelines / runtime

.packages/microsoft.dotnet.helix.sdk/9.0.0-beta.24217.1/tools/azure-pipelines/AzurePipelines.MultiQueue.targets#L44

.packages/microsoft.dotnet.helix.sdk/9.0.0-beta.24217.1/tools/azure-pipelines/AzurePipelines.MultiQueue.targets(44,5): error : (NETCORE_ENGINEERING_TELEMETRY=Test) Test System.Net.Http.Functional.Tests.SocketsHttpHandler_HttpClientHandler_AltSvc_Test_Http3.AltSvc_ConnectionFrame_UpgradeFrom20_Success has failed. Check the Test tab or this console log: https://helix.dot.net/api/2019-06-17/jobs/3cd6f89b-e56e-4a66-9f98-c3efec5ee09f/workitems/System.Net.Http.Functional.Tests/console

Check failure on line 91 in .packages/microsoft.dotnet.helix.sdk/9.0.0-beta.24217.1/tools/Microsoft.DotNet.Helix.Sdk.MultiQueue.targets

See this annotation in the file changed.

@azure-pipelines azure-pipelines / runtime

.packages/microsoft.dotnet.helix.sdk/9.0.0-beta.24217.1/tools/Microsoft.DotNet.Helix.Sdk.MultiQueue.targets#L91

.packages/microsoft.dotnet.helix.sdk/9.0.0-beta.24217.1/tools/Microsoft.DotNet.Helix.Sdk.MultiQueue.targets(91,5): error : (NETCORE_ENGINEERING_TELEMETRY=Test) Work item System.Text.Json.Tests in job 15815f39-feb2-4d4f-9fea-697d1e2ed5a9 has failed.
Failure log: https://helix.dot.net/api/2019-06-17/jobs/15815f39-feb2-4d4f-9fea-697d1e2ed5a9/workitems/System.Text.Json.Tests/console

Check failure on line 91 in .packages/microsoft.dotnet.helix.sdk/9.0.0-beta.24217.1/tools/Microsoft.DotNet.Helix.Sdk.MultiQueue.targets

See this annotation in the file changed.

@azure-pipelines azure-pipelines / runtime

.packages/microsoft.dotnet.helix.sdk/9.0.0-beta.24217.1/tools/Microsoft.DotNet.Helix.Sdk.MultiQueue.targets#L91

.packages/microsoft.dotnet.helix.sdk/9.0.0-beta.24217.1/tools/Microsoft.DotNet.Helix.Sdk.MultiQueue.targets(91,5): error : (NETCORE_ENGINEERING_TELEMETRY=Test) Work item System.Text.Json.Tests in job 45d71ccf-2fe7-4240-b8a3-529d59c6a462 has failed.
Failure log: https://helix.dot.net/api/2019-06-17/jobs/45d71ccf-2fe7-4240-b8a3-529d59c6a462/workitems/System.Text.Json.Tests/console

Check failure on line 91 in .packages/microsoft.dotnet.helix.sdk/9.0.0-beta.24217.1/tools/Microsoft.DotNet.Helix.Sdk.MultiQueue.targets

See this annotation in the file changed.

@azure-pipelines azure-pipelines / runtime

.packages/microsoft.dotnet.helix.sdk/9.0.0-beta.24217.1/tools/Microsoft.DotNet.Helix.Sdk.MultiQueue.targets#L91

.packages/microsoft.dotnet.helix.sdk/9.0.0-beta.24217.1/tools/Microsoft.DotNet.Helix.Sdk.MultiQueue.targets(91,5): error : (NETCORE_ENGINEERING_TELEMETRY=Test) Work item System.Text.Json.Tests in job 4e44e85b-7bb7-4b68-894a-f551d8d0ab02 has failed.
Failure log: https://helix.dot.net/api/2019-06-17/jobs/4e44e85b-7bb7-4b68-894a-f551d8d0ab02/workitems/System.Text.Json.Tests/console

Check failure on line 1 in WasmTestOnChrome-System.Net.Http.Functional.Tests.WorkItemExecution

See this annotation in the file changed.

@azure-pipelines azure-pipelines / runtime

WasmTestOnChrome-System.Net.Http.Functional.Tests.WorkItemExecution

The Helix Work Item failed. Often this is due to a test crash. Please see the 'Artifacts' tab above for additional logs.

Check failure on line 1 in System.Text.Json.Tests.WorkItemExecution

See this annotation in the file changed.

@azure-pipelines azure-pipelines / runtime

System.Text.Json.Tests.WorkItemExecution

The Helix Work Item failed. Often this is due to a test crash. Please see the 'Artifacts' tab above for additional logs.

Check failure on line 1 in System.Text.Json.Tests.WorkItemExecution

See this annotation in the file changed.

@azure-pipelines azure-pipelines / runtime

System.Text.Json.Tests.WorkItemExecution

The Helix Work Item failed. Often this is due to a test crash. Please see the 'Artifacts' tab above for additional logs.

Check failure on line 1 in System.Text.Json.Tests.WorkItemExecution

See this annotation in the file changed.

@azure-pipelines azure-pipelines / runtime

System.Text.Json.Tests.WorkItemExecution

The Helix Work Item failed. Often this is due to a test crash. Please see the 'Artifacts' tab above for additional logs.