Skip to content

Update .github/workflows/cloudtest.yml #6737

Update .github/workflows/cloudtest.yml

Update .github/workflows/cloudtest.yml #6737

GitHub Actions / JUnit Test Report failed Feb 17, 2025 in 0s

9 tests run, 8 passed, 0 skipped, 1 failed.

Annotations

Check failure on line 1 in Test pipeline

See this annotation in the file changed.

@github-actions github-actions / JUnit Test Report

Test pipeline.Run with profile test | --tools strelka --no_intervals | somatic

Assertion failed: 

2 of 2 assertions failed
Raw output
Nextflow stdout:

N E X T F L O W  ~  version 25.01.0-edge
Launching `/home/runner/work/sarek/sarek/tests/../main.nf` [berserk_sanger] DSL2 - revision: 3954909713

------------------------------------------------------
                                        ,--./,-.
        ___     __   __   __   ___     /,-._.--~'
  |\ | |__  __ /  ` /  \ |__) |__         }  {
  | \| |       \__, \__/ |  \ |___     \`-._,-`-,
                                        `._,._,'
      ____
    .´ _  `.
   /  |\`-_ \      __        __   ___     
  |   | \  `-|    |__`  /\  |__) |__  |__/
   \ |   \  /     .__| /¯¯\ |  \ |___ |  \
    `|____\´

  nf-core/sarek 3.5.1
------------------------------------------------------
Input/output options
  input                     : /home/runner/work/sarek/sarek/tests/csv/3.0/recalibrated_somatic.csv
  step                      : variant_calling
  outdir                    : /home/runner/work/sarek/sarek/~/tests/a25df8ae6d08704eae218f7a45a79e60/output

Main options
  split_fastq               : 0
  intervals                 : https://raw.githubusercontent.com/nf-core/test-datasets/modules/data/genomics/homo_sapiens/genome/chr21/sequence/multi_intervals.bed
  no_intervals              : true
  tools                     : strelka

Annotation
  bcftools_annotations      : https://raw.githubusercontent.com/nf-core/test-datasets/modules/data//genomics/sarscov2/illumina/vcf/test2.vcf.gz
  bcftools_annotations_tbi  : https://raw.githubusercontent.com/nf-core/test-datasets/modules/data//genomics/sarscov2/illumina/vcf/test2.vcf.gz.tbi
  bcftools_header_lines     : /home/runner/work/sarek/sarek/tests/config/bcfann_test_header.txt

General reference genome options
  igenomes_base             : https://raw.githubusercontent.com/nf-core/test-datasets/modules/data/

Reference genome options
  genome                    : testdata.nf-core.sarek
  dbsnp                     : https://raw.githubusercontent.com/nf-core/test-datasets/modules/data//genomics/homo_sapiens/genome/vcf/dbsnp_146.hg38.vcf.gz
  dbsnp_tbi                 : https://raw.githubusercontent.com/nf-core/test-datasets/modules/data//genomics/homo_sapiens/genome/vcf/dbsnp_146.hg38.vcf.gz.tbi
  dbsnp_vqsr                : --resource:dbsnp,known=false,training=true,truth=false,prior=2.0 dbsnp_146.hg38.vcf.gz
  dict                      : https://raw.githubusercontent.com/nf-core/test-datasets/modules/data//genomics/homo_sapiens/genome/genome.dict
  fasta                     : https://raw.githubusercontent.com/nf-core/test-datasets/modules/data/genomics/homo_sapiens/genome/chr21/sequence/genome.fasta
  fasta_fai                 : https://raw.githubusercontent.com/nf-core/test-datasets/modules/data/genomics/homo_sapiens/genome/chr21/sequence/genome.fasta.fai
  germline_resource         : https://raw.githubusercontent.com/nf-core/test-datasets/modules/data//genomics/homo_sapiens/genome/vcf/gnomAD.r2.1.1.vcf.gz
  germline_resource_tbi     : https://raw.githubusercontent.com/nf-core/test-datasets/modules/data//genomics/homo_sapiens/genome/vcf/gnomAD.r2.1.1.vcf.gz.tbi
  known_indels              : https://raw.githubusercontent.com/nf-core/test-datasets/modules/data//genomics/homo_sapiens/genome/vcf/mills_and_1000G.indels.vcf.gz
  known_indels_tbi          : https://raw.githubusercontent.com/nf-core/test-datasets/modules/data//genomics/homo_sapiens/genome/vcf/mills_and_1000G.indels.vcf.gz.tbi
  known_indels_vqsr         : --resource:mills,known=false,training=true,truth=true,prior=10.0 mills_and_1000G.indels.vcf.gz
  ngscheckmate_bed          : https://raw.githubusercontent.com/nf-core/test-datasets/modules/data//genomics/homo_sapiens/genome/chr21/germlineresources/SNP_GRCh38_hg38_wChr.bed
  sentieon_dnascope_model   : s3://ngi-igenomes/igenomes/Homo_sapiens/GATK/GRCh38/Annotation/Sentieon/SentieonDNAscopeModel1.1.model
  snpeff_cache              : null
  snpeff_db                 : WBcel235.105
  vep_cache                 : null
  vep_cache_version         : 113
  vep_genome                : WBcel235
  vep_species               : caenorhabditis_elegans

Institutional config options
  config_profile_name       : Test profile
  config_profile_description: Minimal test dataset to check pipeline function
  modules_testdata_base_path: https://raw.githubusercontent.com/nf-core/test-datasets/modules/data/

Core Nextflow options
  runName                   : berserk_sanger
  launchDir                 : /home/runner/work/sarek/sarek/~/tests/a25df8ae6d08704eae218f7a45a79e60
  workDir                   : /home/runner/work/sarek/sarek/~/tests/a25df8ae6d08704eae218f7a45a79e60/work
  projectDir                : /home/runner/work/sarek/sarek
  userName                  : runner
  profile                   : test,conda
  configFiles               : /home/runner/work/sarek/sarek/nextflow.config, /home/runner/work/sarek/sarek/nextflow.config, /home/runner/work/sarek/sarek/conf/test.config

!! Only displaying parameters that differ from the pipeline defaults !!
------------------------------------------------------
* The pipeline
    https://doi.org/10.12688/f1000research.16665.2
    https://doi.org/10.1093/nargab/lqae031
    https://doi.org/10.5281/zenodo.3476425

* The nf-core framework
    https://doi.org/10.1038/s41587-020-0439-x

* Software dependencies
    https://github.com/nf-core/sarek/blob/master/CITATIONS.md

Creating env using conda: /home/runner/work/sarek/sarek/./subworkflows/local/prepare_intervals/../../../modules/nf-core/tabix/bgziptabix/environment.yml [cache /home/runner/work/sarek/sarek/~/tests/a25df8ae6d08704eae218f7a45a79e60/work/conda/env-5a9ba0ebb7bcf86c-497b0f18c811c5671b5e17e0034188ed]
Staging foreign file: https://raw.githubusercontent.com/nf-core/test-datasets/modules/data/genomics/homo_sapiens/genome/chr21/sequence/genome.fasta
Creating env using conda: /home/runner/work/sarek/sarek/./workflows/sarek/../../subworkflows/local/cram_sampleqc/../../../subworkflows/local/cram_qc_mosdepth_samtools/../../../modules/nf-core/samtools/stats/environment.yml [cache /home/runner/work/sarek/sarek/~/tests/a25df8ae6d08704eae218f7a45a79e60/work/conda/env-1abf3db016bf3fb9-873a3583ebab040412cb72c07ed757ab]
Creating env using conda: /home/runner/work/sarek/sarek/./workflows/sarek/../../subworkflows/local/bam_variant_calling_germline_all/../bam_variant_calling_single_strelka/../../../modules/nf-core/strelka/germline/environment.yml [cache /home/runner/work/sarek/sarek/~/tests/a25df8ae6d08704eae218f7a45a79e60/work/conda/env-90ad7ffecab6b5bf-438a505d7b44a08705c858f9ad6e02ce]
Creating env using conda: /home/runner/work/sarek/sarek/./workflows/sarek/../../subworkflows/local/cram_sampleqc/../../../subworkflows/local/cram_qc_mosdepth_samtools/../../../modules/nf-core/mosdepth/environment.yml [cache /home/runner/work/sarek/sarek/~/tests/a25df8ae6d08704eae218f7a45a79e60/work/conda/env-c5b497d07713b814-57cd7e91fe23a8ceb488416c37dae89b]
Creating env using conda: /home/runner/work/sarek/sarek/./workflows/sarek/../../subworkflows/local/bam_variant_calling_somatic_all/../bam_variant_calling_somatic_strelka/../../../modules/nf-core/strelka/somatic/environment.yml [cache /home/runner/work/sarek/sarek/~/tests/a25df8ae6d08704eae218f7a45a79e60/work/conda/env-45ec49f1ad56587b-438a505d7b44a08705c858f9ad6e02ce]
[3c/9e79f6] Submitted process > NFCORE_SAREK:PREPARE_INTERVALS:TABIX_BGZIPTABIX_INTERVAL_COMBINED (no_intervals)
[28/c33f1f] Submitted process > NFCORE_SAREK:SAREK:BAM_VARIANT_CALLING_SOMATIC_ALL:BAM_VARIANT_CALLING_SOMATIC_STRELKA:STRELKA_SOMATIC (sample4_vs_sample3)
[73/b0d70f] Submitted process > NFCORE_SAREK:SAREK:CRAM_SAMPLEQC:CRAM_QC_RECAL:MOSDEPTH (sample4)
[28/c33f1f] NOTE: Process `NFCORE_SAREK:SAREK:BAM_VARIANT_CALLING_SOMATIC_ALL:BAM_VARIANT_CALLING_SOMATIC_STRELKA:STRELKA_SOMATIC (sample4_vs_sample3)` terminated with an error exit status (1) -- Execution is retried (1)
[75/bd01b2] Submitted process > NFCORE_SAREK:SAREK:CRAM_SAMPLEQC:CRAM_QC_RECAL:MOSDEPTH (sample3)
[fd/e5078a] Re-submitted process > NFCORE_SAREK:SAREK:BAM_VARIANT_CALLING_SOMATIC_ALL:BAM_VARIANT_CALLING_SOMATIC_STRELKA:STRELKA_SOMATIC (sample4_vs_sample3)
[fd/e5078a] NOTE: Process `NFCORE_SAREK:SAREK:BAM_VARIANT_CALLING_SOMATIC_ALL:BAM_VARIANT_CALLING_SOMATIC_STRELKA:STRELKA_SOMATIC (sample4_vs_sample3)` terminated with an error exit status (1) -- Execution is retried (2)
[7b/1dc9e3] Submitted process > NFCORE_SAREK:SAREK:BAM_VARIANT_CALLING_GERMLINE_ALL:BAM_VARIANT_CALLING_SINGLE_STRELKA:STRELKA_SINGLE (sample3)
[6c/d625e5] Submitted process > NFCORE_SAREK:SAREK:CRAM_SAMPLEQC:CRAM_QC_RECAL:SAMTOOLS_STATS (sample4)
[78/c61e28] Submitted process > NFCORE_SAREK:SAREK:CRAM_SAMPLEQC:CRAM_QC_RECAL:SAMTOOLS_STATS (sample3)
Creating env using conda: /home/runner/work/sarek/sarek/./workflows/sarek/../../subworkflows/local/vcf_qc_bcftools_vcftools/../../../modules/nf-core/vcftools/environment.yml [cache /home/runner/work/sarek/sarek/~/tests/a25df8ae6d08704eae218f7a45a79e60/work/conda/env-ac437bb99679f3c6-ede778c78582be405557f3c8ca0e9927]
Creating env using conda: /home/runner/work/sarek/sarek/./workflows/sarek/../../subworkflows/local/vcf_qc_bcftools_vcftools/../../../modules/nf-core/bcftools/stats/environment.yml [cache /home/runner/work/sarek/sarek/~/tests/a25df8ae6d08704eae218f7a45a79e60/work/conda/env-d14f40c429aefa2b-dc6f2c13cbbb0f956fd0966de87d7df8]
[91/913b0f] Re-submitted process > NFCORE_SAREK:SAREK:BAM_VARIANT_CALLING_SOMATIC_ALL:BAM_VARIANT_CALLING_SOMATIC_STRELKA:STRELKA_SOMATIC (sample4_vs_sample3)
[77/f5b53e] Submitted process > NFCORE_SAREK:SAREK:VCF_QC_BCFTOOLS_VCFTOOLS:VCFTOOLS_TSTV_QUAL (sample3)
[21/5aca1c] Submitted process > NFCORE_SAREK:SAREK:VCF_QC_BCFTOOLS_VCFTOOLS:VCFTOOLS_TSTV_COUNT (sample3)
ERROR ~ Error executing process > 'NFCORE_SAREK:SAREK:BAM_VARIANT_CALLING_SOMATIC_ALL:BAM_VARIANT_CALLING_SOMATIC_STRELKA:STRELKA_SOMATIC (sample4_vs_sample3)'

Caused by:
  Process `NFCORE_SAREK:SAREK:BAM_VARIANT_CALLING_SOMATIC_ALL:BAM_VARIANT_CALLING_SOMATIC_STRELKA:STRELKA_SOMATIC (sample4_vs_sample3)` terminated with an error exit status (1)


Command executed:

  configureStrelkaSomaticWorkflow.py \
      --tumor test2.paired_end.recalibrated.sorted.cram \
      --normal test.paired_end.recalibrated.sorted.cram \
      --referenceFasta genome.fasta \
       \
       \
       \
      --runDir strelka
  
  sed -i s/"isEmail = isLocalSmtp()"/"isEmail = False"/g strelka/runWorkflow.py
  
  python strelka/runWorkflow.py -m local -j 4
  mv strelka/results/variants/somatic.indels.vcf.gz     sample4_vs_sample3.strelka.somatic_indels.vcf.gz
  mv strelka/results/variants/somatic.indels.vcf.gz.tbi sample4_vs_sample3.strelka.somatic_indels.vcf.gz.tbi
  mv strelka/results/variants/somatic.snvs.vcf.gz       sample4_vs_sample3.strelka.somatic_snvs.vcf.gz
  mv strelka/results/variants/somatic.snvs.vcf.gz.tbi   sample4_vs_sample3.strelka.somatic_snvs.vcf.gz.tbi
  
  cat <<-END_VERSIONS > versions.yml
  "NFCORE_SAREK:SAREK:BAM_VARIANT_CALLING_SOMATIC_ALL:BAM_VARIANT_CALLING_SOMATIC_STRELKA:STRELKA_SOMATIC":
      strelka: $( configureStrelkaSomaticWorkflow.py --version )
  END_VERSIONS

Command exit status:
  1

Command output:
  
  Successfully created workflow run script.
  To execute the workflow, run the following script and set appropriate options:
  
  strelka/runWorkflow.py

Command error:
  [2025-02-17T18:18:51.252552Z] [fv-az1910-428.atjgolet2xaebjmaknva5kv5uc.ex.internal.cloudapp.net] [130000_1] [TaskManager] [ERROR] [CallGenome+callGenomeSegment_chromId_000_chr21_0000] [taskWrapper-stderr] [2025-02-17T18:18:51.205391Z] [fv-az1910-428.atjgolet2xaebjmaknva5kv5uc.ex.internal.cloudapp.net] [130000_1] [pyflowTaskWrapper:CallGenome+callGenomeSegment_chromId_000_chr21_0000] [wrapperSignal] taskStderrTail 1
  [2025-02-17T18:18:51.252605Z] [fv-az1910-428.atjgolet2xaebjmaknva5kv5uc.ex.internal.cloudapp.net] [130000_1] [TaskManager] [ERROR] [CallGenome+callGenomeSegment_chromId_000_chr21_0000] [taskWrapper-stderr] Last 0 stderr lines from task (of 0 total lines):
  [2025-02-17T18:18:51.253140Z] [fv-az1910-428.atjgolet2xaebjmaknva5kv5uc.ex.internal.cloudapp.net] [130000_1] [TaskManager] [ERROR] Failed to complete command task: 'CallGenome+callGenomeSegment_chromId_000_chr21_0001' launched from sub-workflow 'CallGenome', error code: 1, command: '/home/runner/work/sarek/sarek/~/tests/a25df8ae6d08704eae218f7a45a79e60/work/conda/env-45ec49f1ad56587b-438a505d7b44a08705c858f9ad6e02ce/share/strelka-2.9.10-2/libexec/strelka2 --region chr21:11677497-23354992 --ref genome.fasta --max-indel-size 49 --min-mapping-quality 20 --somatic-snv-rate 0.0001 --shared-site-error-rate 0.0000000005 --shared-site-error-strand-bias-fraction 0.0 --somatic-indel-rate 0.000001 --shared-indel-error-factor 2.2 --tier2-min-mapping-quality 0 --strelka-snv-max-filtered-basecall-frac 0.4 --strelka-snv-max-spanning-deletion-frac 0.75 --strelka-snv-min-qss-ref 15 --strelka-indel-max-window-filtered-basecall-frac 0.3 --strelka-indel-min-qsi-ref 40 --ssnv-contam-tolerance 0.15 --indel-contam-tolerance 0.15 --somatic-snv-scoring-model-file /home/runner/work/sarek/sarek/~/tests/a25df8ae6d08704eae218f7a45a79e60/work/conda/env-45ec49f1ad56587b-438a505d7b44a08705c858f9ad6e02ce/share/strelka-2.9.10-2/share/config/somaticSNVScoringModels.json --somatic-indel-scoring-model-file /home/runner/work/sarek/sarek/~/tests/a25df8ae6d08704eae218f7a45a79e60/work/conda/env-45ec49f1ad56587b-438a505d7b44a08705c858f9ad6e02ce/share/strelka-2.9.10-2/share/config/somaticIndelScoringModels.json --normal-align-file test.paired_end.recalibrated.sorted.cram --tumor-align-file test2.paired_end.recalibrated.sorted.cram --somatic-snv-file strelka/workspace/genomeSegment.tmpdir/somatic.snvs.unfiltered.chromId_000_chr21_0001.vcf --somatic-indel-file strelka/workspace/genomeSegment.tmpdir/somatic.indels.unfiltered.chromId_000_chr21_0001.vcf --stats-file strelka/workspace/genomeSegment.tmpdir/runStats.chromId_000_chr21_0001.xml --strelka-skip-header --strelka-chrom-depth-file strelka/workspace/chromDepth.tsv --strelka-max-depth-factor 3.0'
  [2025-02-17T18:18:51.253196Z] [fv-az1910-428.atjgolet2xaebjmaknva5kv5uc.ex.internal.cloudapp.net] [130000_1] [TaskManager] [ERROR] [CallGenome+callGenomeSegment_chromId_000_chr21_0001] Error Message:
  [2025-02-17T18:18:51.253579Z] [fv-az1910-428.atjgolet2xaebjmaknva5kv5uc.ex.internal.cloudapp.net] [130000_1] [TaskManager] [ERROR] [CallGenome+callGenomeSegment_chromId_000_chr21_0001] Anomalous task wrapper stderr output. Wrapper signal file: 'strelka/workspace/pyflow.data/logs/tmp/taskWrapperLogs/000/011/pyflowTaskWrapper.signal.txt'
  [2025-02-17T18:18:51.253652Z] [fv-az1910-428.atjgolet2xaebjmaknva5kv5uc.ex.internal.cloudapp.net] [130000_1] [TaskManager] [ERROR] [CallGenome+callGenomeSegment_chromId_000_chr21_0001] Logging 5 line(s) of task wrapper log output below:
  [2025-02-17T18:18:51.253677Z] [fv-az1910-428.atjgolet2xaebjmaknva5kv5uc.ex.internal.cloudapp.net] [130000_1] [TaskManager] [ERROR] [CallGenome+callGenomeSegment_chromId_000_chr21_0001] [taskWrapper-stderr] [2025-02-17T18:18:50.963866Z] [fv-az1910-428.atjgolet2xaebjmaknva5kv5uc.ex.internal.cloudapp.net] [130000_1] [pyflowTaskWrapper:CallGenome+callGenomeSegment_chromId_000_chr21_0001] [wrapperSignal] wrapperStart
  [2025-02-17T18:18:51.253703Z] [fv-az1910-428.atjgolet2xaebjmaknva5kv5uc.ex.internal.cloudapp.net] [130000_1] [TaskManager] [ERROR] [CallGenome+callGenomeSegment_chromId_000_chr21_0001] [taskWrapper-stderr] [2025-02-17T18:18:50.978768Z] [fv-az1910-428.atjgolet2xaebjmaknva5kv5uc.ex.internal.cloudapp.net] [130000_1] [pyflowTaskWrapper:CallGenome+callGenomeSegment_chromId_000_chr21_0001] [wrapperSignal] taskStart
  [2025-02-17T18:18:51.253729Z] [fv-az1910-428.atjgolet2xaebjmaknva5kv5uc.ex.internal.cloudapp.net] [130000_1] [TaskManager] [ERROR] [CallGenome+callGenomeSegment_chromId_000_chr21_0001] [taskWrapper-stderr] [2025-02-17T18:18:51.216785Z] [fv-az1910-428.atjgolet2xaebjmaknva5kv5uc.ex.internal.cloudapp.net] [130000_1] [pyflowTaskWrapper:CallGenome+callGenomeSegment_chromId_000_chr21_0001] [wrapperSignal] taskExitCode -11
  [2025-02-17T18:18:51.253755Z] [fv-az1910-428.atjgolet2xaebjmaknva5kv5uc.ex.internal.cloudapp.net] [130000_1] [TaskManager] [ERROR] [CallGenome+callGenomeSegment_chromId_000_chr21_0001] [taskWrapper-stderr] [2025-02-17T18:18:51.220140Z] [fv-az1910-428.atjgolet2xaebjmaknva5kv5uc.ex.internal.cloudapp.net] [130000_1] [pyflowTaskWrapper:CallGenome+callGenomeSegment_chromId_000_chr21_0001] [wrapperSignal] taskStderrTail 1
  [2025-02-17T18:18:51.253797Z] [fv-az1910-428.atjgolet2xaebjmaknva5kv5uc.ex.internal.cloudapp.net] [130000_1] [TaskManager] [ERROR] [CallGenome+callGenomeSegment_chromId_000_chr21_0001] [taskWrapper-stderr] Last 0 stderr lines from task (of 0 total lines):
  [2025-02-17T18:18:51.869729Z] [fv-az1910-428.atjgolet2xaebjmaknva5kv5uc.ex.internal.cloudapp.net] [130000_1] [TaskManager] [ERROR] Failed to complete sub-workflow task: 'CallGenome' launched from master workflow, failed sub-workflow classname: 'CallWorkflow'
  [2025-02-17T18:18:54.388720Z] [fv-az1910-428.atjgolet2xaebjmaknva5kv5uc.ex.internal.cloudapp.net] [130000_1] [WorkflowRunner] [ERROR] Workflow terminated due to the following task errors:
  [2025-02-17T18:18:54.388792Z] [fv-az1910-428.atjgolet2xaebjmaknva5kv5uc.ex.internal.cloudapp.net] [130000_1] [WorkflowRunner] [ERROR] Failed to complete command task: 'CallGenome+callGenomeSegment_chromId_000_chr21_0002' launched from sub-workflow 'CallGenome', error code: 1, command: '/home/runner/work/sarek/sarek/~/tests/a25df8ae6d08704eae218f7a45a79e60/work/conda/env-45ec49f1ad56587b-438a505d7b44a08705c858f9ad6e02ce/share/strelka-2.9.10-2/libexec/strelka2 --region chr21:23354993-35032488 --ref genome.fasta --max-indel-size 49 --min-mapping-quality 20 --somatic-snv-rate 0.0001 --shared-site-error-rate 0.0000000005 --shared-site-error-strand-bias-fraction 0.0 --somatic-indel-rate 0.000001 --shared-indel-error-factor 2.2 --tier2-min-mapping-quality 0 --strelka-snv-max-filtered-basecall-frac 0.4 --strelka-snv-max-spanning-deletion-frac 0.75 --strelka-snv-min-qss-ref 15 --strelka-indel-max-window-filtered-basecall-frac 0.3 --strelka-indel-min-qsi-ref 40 --ssnv-contam-tolerance 0.15 --indel-contam-tolerance 0.15 --somatic-snv-scoring-model-file /home/runner/work/sarek/sarek/~/tests/a25df8ae6d08704eae218f7a45a79e60/work/conda/env-45ec49f1ad56587b-438a505d7b44a08705c858f9ad6e02ce/share/strelka-2.9.10-2/share/config/somaticSNVScoringModels.json --somatic-indel-scoring-model-file /home/runner/work/sarek/sarek/~/tests/a25df8ae6d08704eae218f7a45a79e60/work/conda/env-45ec49f1ad56587b-438a505d7b44a08705c858f9ad6e02ce/share/strelka-2.9.10-2/share/config/somaticIndelScoringModels.json --normal-align-file test.paired_end.recalibrated.sorted.cram --tumor-align-file test2.paired_end.recalibrated.sorted.cram --somatic-snv-file strelka/workspace/genomeSegment.tmpdir/somatic.snvs.unfiltered.chromId_000_chr21_0002.vcf --somatic-indel-file strelka/workspace/genomeSegment.tmpdir/somatic.indels.unfiltered.chromId_000_chr21_0002.vcf --stats-file strelka/workspace/genomeSegment.tmpdir/runStats.chromId_000_chr21_0002.xml --strelka-skip-header --strelka-chrom-depth-file strelka/workspace/chromDepth.tsv --strelka-max-depth-factor 3.0'
  [2025-02-17T18:18:54.388821Z] [fv-az1910-428.atjgolet2xaebjmaknva5kv5uc.ex.internal.cloudapp.net] [130000_1] [WorkflowRunner] [ERROR] [CallGenome+callGenomeSegment_chromId_000_chr21_0002] Error Message:
  [2025-02-17T18:18:54.388832Z] [fv-az1910-428.atjgolet2xaebjmaknva5kv5uc.ex.internal.cloudapp.net] [130000_1] [WorkflowRunner] [ERROR] [CallGenome+callGenomeSegment_chromId_000_chr21_0002] Anomalous task wrapper stderr output. Wrapper signal file: 'strelka/workspace/pyflow.data/logs/tmp/taskWrapperLogs/000/013/pyflowTaskWrapper.signal.txt'
  [2025-02-17T18:18:54.388848Z] [fv-az1910-428.atjgolet2xaebjmaknva5kv5uc.ex.internal.cloudapp.net] [130000_1] [WorkflowRunner] [ERROR] [CallGenome+callGenomeSegment_chromId_000_chr21_0002] Logging 5 line(s) of task wrapper log output below:
  [2025-02-17T18:18:54.388863Z] [fv-az1910-428.atjgolet2xaebjmaknva5kv5uc.ex.internal.cloudapp.net] [130000_1] [WorkflowRunner] [ERROR] [CallGenome+callGenomeSegment_chromId_000_chr21_0002] [taskWrapper-stderr] [2025-02-17T18:18:50.940854Z] [fv-az1910-428.atjgolet2xaebjmaknva5kv5uc.ex.internal.cloudapp.net] [130000_1] [pyflowTaskWrapper:CallGenome+callGenomeSegment_chromId_000_chr21_0002] [wrapperSignal] wrapperStart
  [2025-02-17T18:18:54.388878Z] [fv-az1910-428.atjgolet2xaebjmaknva5kv5uc.ex.internal.cloudapp.net] [130000_1] [WorkflowRunner] [ERROR] [CallGenome+callGenomeSegment_chromId_000_chr21_0002] [taskWrapper-stderr] [2025-02-17T18:18:50.953645Z] [fv-az1910-428.atjgolet2xaebjmaknva5kv5uc.ex.internal.cloudapp.net] [130000_1] [pyflowTaskWrapper:CallGenome+callGenomeSegment_chromId_000_chr21_0002] [wrapperSignal] taskStart
  [2025-02-17T18:18:54.388891Z] [fv-az1910-428.atjgolet2xaebjmaknva5kv5uc.ex.internal.cloudapp.net] [130000_1] [WorkflowRunner] [ERROR] [CallGenome+callGenomeSegment_chromId_000_chr21_0002] [taskWrapper-stderr] [2025-02-17T18:18:51.144034Z] [fv-az1910-428.atjgolet2xaebjmaknva5kv5uc.ex.internal.cloudapp.net] [130000_1] [pyflowTaskWrapper:CallGenome+callGenomeSegment_chromId_000_chr21_0002] [wrapperSignal] taskExitCode -11
  [2025-02-17T18:18:54.388905Z] [fv-az1910-428.atjgolet2xaebjmaknva5kv5uc.ex.internal.cloudapp.net] [130000_1] [WorkflowRunner] [ERROR] [CallGenome+callGenomeSegment_chromId_000_chr21_0002] [taskWrapper-stderr] [2025-02-17T18:18:51.146672Z] [fv-az1910-428.atjgolet2xaebjmaknva5kv5uc.ex.internal.cloudapp.net] [130000_1] [pyflowTaskWrapper:CallGenome+callGenomeSegment_chromId_000_chr21_0002] [wrapperSignal] taskStderrTail 1
  [2025-02-17T18:18:54.388916Z] [fv-az1910-428.atjgolet2xaebjmaknva5kv5uc.ex.internal.cloudapp.net] [130000_1] [WorkflowRunner] [ERROR] [CallGenome+callGenomeSegment_chromId_000_chr21_0002] [taskWrapper-stderr] Last 0 stderr lines from task (of 0 total lines):
  [2025-02-17T18:18:54.388934Z] [fv-az1910-428.atjgolet2xaebjmaknva5kv5uc.ex.internal.cloudapp.net] [130000_1] [WorkflowRunner] [ERROR] Failed to complete command task: 'CallGenome+callGenomeSegment_chromId_000_chr21_0001' launched from sub-workflow 'CallGenome', error code: 1, command: '/home/runner/work/sarek/sarek/~/tests/a25df8ae6d08704eae218f7a45a79e60/work/conda/env-45ec49f1ad56587b-438a505d7b44a08705c858f9ad6e02ce/share/strelka-2.9.10-2/libexec/strelka2 --region chr21:11677497-23354992 --ref genome.fasta --max-indel-size 49 --min-mapping-quality 20 --somatic-snv-rate 0.0001 --shared-site-error-rate 0.0000000005 --shared-site-error-strand-bias-fraction 0.0 --somatic-indel-rate 0.000001 --shared-indel-error-factor 2.2 --tier2-min-mapping-quality 0 --strelka-snv-max-filtered-basecall-frac 0.4 --strelka-snv-max-spanning-deletion-frac 0.75 --strelka-snv-min-qss-ref 15 --strelka-indel-max-window-filtered-basecall-frac 0.3 --strelka-indel-min-qsi-ref 40 --ssnv-contam-tolerance 0.15 --indel-contam-tolerance 0.15 --somatic-snv-scoring-model-file /home/runner/work/sarek/sarek/~/tests/a25df8ae6d08704eae218f7a45a79e60/work/conda/env-45ec49f1ad56587b-438a505d7b44a08705c858f9ad6e02ce/share/strelka-2.9.10-2/share/config/somaticSNVScoringModels.json --somatic-indel-scoring-model-file /home/runner/work/sarek/sarek/~/tests/a25df8ae6d08704eae218f7a45a79e60/work/conda/env-45ec49f1ad56587b-438a505d7b44a08705c858f9ad6e02ce/share/strelka-2.9.10-2/share/config/somaticIndelScoringModels.json --normal-align-file test.paired_end.recalibrated.sorted.cram --tumor-align-file test2.paired_end.recalibrated.sorted.cram --somatic-snv-file strelka/workspace/genomeSegment.tmpdir/somatic.snvs.unfiltered.chromId_000_chr21_0001.vcf --somatic-indel-file strelka/workspace/genomeSegment.tmpdir/somatic.indels.unfiltered.chromId_000_chr21_0001.vcf --stats-file strelka/workspace/genomeSegment.tmpdir/runStats.chromId_000_chr21_0001.xml --strelka-skip-header --strelka-chrom-depth-file strelka/workspace/chromDepth.tsv --strelka-max-depth-factor 3.0'
  [2025-02-17T18:18:54.388957Z] [fv-az1910-428.atjgolet2xaebjmaknva5kv5uc.ex.internal.cloudapp.net] [130000_1] [WorkflowRunner] [ERROR] [CallGenome+callGenomeSegment_chromId_000_chr21_0001] Error Message:
  [2025-02-17T18:18:54.388966Z] [fv-az1910-428.atjgolet2xaebjmaknva5kv5uc.ex.internal.cloudapp.net] [130000_1] [WorkflowRunner] [ERROR] [CallGenome+callGenomeSegment_chromId_000_chr21_0001] Anomalous task wrapper stderr output. Wrapper signal file: 'strelka/workspace/pyflow.data/logs/tmp/taskWrapperLogs/000/011/pyflowTaskWrapper.signal.txt'
  [2025-02-17T18:18:54.388976Z] [fv-az1910-428.atjgolet2xaebjmaknva5kv5uc.ex.internal.cloudapp.net] [130000_1] [WorkflowRunner] [ERROR] [CallGenome+callGenomeSegment_chromId_000_chr21_0001] Logging 5 line(s) of task wrapper log output below:
  [2025-02-17T18:18:54.388988Z] [fv-az1910-428.atjgolet2xaebjmaknva5kv5uc.ex.internal.cloudapp.net] [130000_1] [WorkflowRunner] [ERROR] [CallGenome+callGenomeSegment_chromId_000_chr21_0001] [taskWrapper-stderr] [2025-02-17T18:18:50.963866Z] [fv-az1910-428.atjgolet2xaebjmaknva5kv5uc.ex.internal.cloudapp.net] [130000_1] [pyflowTaskWrapper:CallGenome+callGenomeSegment_chromId_000_chr21_0001] [wrapperSignal] wrapperStart
  [2025-02-17T18:18:54.389004Z] [fv-az1910-428.atjgolet2xaebjmaknva5kv5uc.ex.internal.cloudapp.net] [130000_1] [WorkflowRunner] [ERROR] [CallGenome+callGenomeSegment_chromId_000_chr21_0001] [taskWrapper-stderr] [2025-02-17T18:18:50.978768Z] [fv-az1910-428.atjgolet2xaebjmaknva5kv5uc.ex.internal.cloudapp.net] [130000_1] [pyflowTaskWrapper:CallGenome+callGenomeSegment_chromId_000_chr21_0001] [wrapperSignal] taskStart
  [2025-02-17T18:18:54.389014Z] [fv-az1910-428.atjgolet2xaebjmaknva5kv5uc.ex.internal.cloudapp.net] [130000_1] [WorkflowRunner] [ERROR] [CallGenome+callGenomeSegment_chromId_000_chr21_0001] [taskWrapper-stderr] [2025-02-17T18:18:51.216785Z] [fv-az1910-428.atjgolet2xaebjmaknva5kv5uc.ex.internal.cloudapp.net] [130000_1] [pyflowTaskWrapper:CallGenome+callGenomeSegment_chromId_000_chr21_0001] [wrapperSignal] taskExitCode -11
  [2025-02-17T18:18:54.389027Z] [fv-az1910-428.atjgolet2xaebjmaknva5kv5uc.ex.internal.cloudapp.net] [130000_1] [WorkflowRunner] [ERROR] [CallGenome+callGenomeSegment_chromId_000_chr21_0001] [taskWrapper-stderr] [2025-02-17T18:18:51.220140Z] [fv-az1910-428.atjgolet2xaebjmaknva5kv5uc.ex.internal.cloudapp.net] [130000_1] [pyflowTaskWrapper:CallGenome+callGenomeSegment_chromId_000_chr21_0001] [wrapperSignal] taskStderrTail 1
  [2025-02-17T18:18:54.389040Z] [fv-az1910-428.atjgolet2xaebjmaknva5kv5uc.ex.internal.cloudapp.net] [130000_1] [WorkflowRunner] [ERROR] [CallGenome+callGenomeSegment_chromId_000_chr21_0001] [taskWrapper-stderr] Last 0 stderr lines from task (of 0 total lines):
  [2025-02-17T18:18:54.389051Z] [fv-az1910-428.atjgolet2xaebjmaknva5kv5uc.ex.internal.cloudapp.net] [130000_1] [WorkflowRunner] [ERROR] Failed to complete sub-workflow task: 'CallGenome' launched from master workflow, failed sub-workflow classname: 'CallWorkflow'
  [2025-02-17T18:18:54.389064Z] [fv-az1910-428.atjgolet2xaebjmaknva5kv5uc.ex.internal.cloudapp.net] [130000_1] [WorkflowRunner] [ERROR] Failed to complete command task: 'CallGenome+callGenomeSegment_chromId_000_chr21_0003' launched from sub-workflow 'CallGenome', error code: 1, command: '/home/runner/work/sarek/sarek/~/tests/a25df8ae6d08704eae218f7a45a79e60/work/conda/env-45ec49f1ad56587b-438a505d7b44a08705c858f9ad6e02ce/share/strelka-2.9.10-2/libexec/strelka2 --region chr21:35032489-46709983 --ref genome.fasta --max-indel-size 49 --min-mapping-quality 20 --somatic-snv-rate 0.0001 --shared-site-error-rate 0.0000000005 --shared-site-error-strand-bias-fraction 0.0 --somatic-indel-rate 0.000001 --shared-indel-error-factor 2.2 --tier2-min-mapping-quality 0 --strelka-snv-max-filtered-basecall-frac 0.4 --strelka-snv-max-spanning-deletion-frac 0.75 --strelka-snv-min-qss-ref 15 --strelka-indel-max-window-filtered-basecall-frac 0.3 --strelka-indel-min-qsi-ref 40 --ssnv-contam-tolerance 0.15 --indel-contam-tolerance 0.15 --somatic-snv-scoring-model-file /home/runner/work/sarek/sarek/~/tests/a25df8ae6d08704eae218f7a45a79e60/work/conda/env-45ec49f1ad56587b-438a505d7b44a08705c858f9ad6e02ce/share/strelka-2.9.10-2/share/config/somaticSNVScoringModels.json --somatic-indel-scoring-model-file /home/runner/work/sarek/sarek/~/tests/a25df8ae6d08704eae218f7a45a79e60/work/conda/env-45ec49f1ad56587b-438a505d7b44a08705c858f9ad6e02ce/share/strelka-2.9.10-2/share/config/somaticIndelScoringModels.json --normal-align-file test.paired_end.recalibrated.sorted.cram --tumor-align-file test2.paired_end.recalibrated.sorted.cram --somatic-snv-file strelka/workspace/genomeSegment.tmpdir/somatic.snvs.unfiltered.chromId_000_chr21_0003.vcf --somatic-indel-file strelka/workspace/genomeSegment.tmpdir/somatic.indels.unfiltered.chromId_000_chr21_0003.vcf --stats-file strelka/workspace/genomeSegment.tmpdir/runStats.chromId_000_chr21_0003.xml --strelka-skip-header --strelka-chrom-depth-file strelka/workspace/chromDepth.tsv --strelka-max-depth-factor 3.0'
  [2025-02-17T18:18:54.389086Z] [fv-az1910-428.atjgolet2xaebjmaknva5kv5uc.ex.internal.cloudapp.net] [130000_1] [WorkflowRunner] [ERROR] [CallGenome+callGenomeSegment_chromId_000_chr21_0003] Error Message:
  [2025-02-17T18:18:54.389095Z] [fv-az1910-428.atjgolet2xaebjmaknva5kv5uc.ex.internal.cloudapp.net] [130000_1] [WorkflowRunner] [ERROR] [CallGenome+callGenomeSegment_chromId_000_chr21_0003] Anomalous task wrapper stderr output. Wrapper signal file: 'strelka/workspace/pyflow.data/logs/tmp/taskWrapperLogs/000/015/pyflowTaskWrapper.signal.txt'
  [2025-02-17T18:18:54.389108Z] [fv-az1910-428.atjgolet2xaebjmaknva5kv5uc.ex.internal.cloudapp.net] [130000_1] [WorkflowRunner] [ERROR] [CallGenome+callGenomeSegment_chromId_000_chr21_0003] Logging 5 line(s) of task wrapper log output below:
  [2025-02-17T18:18:54.389117Z] [fv-az1910-428.atjgolet2xaebjmaknva5kv5uc.ex.internal.cloudapp.net] [130000_1] [WorkflowRunner] [ERROR] [CallGenome+callGenomeSegment_chromId_000_chr21_0003] [taskWrapper-stderr] [2025-02-17T18:18:50.958409Z] [fv-az1910-428.atjgolet2xaebjmaknva5kv5uc.ex.internal.cloudapp.net] [130000_1] [pyflowTaskWrapper:CallGenome+callGenomeSegment_chromId_000_chr21_0003] [wrapperSignal] wrapperStart
  [2025-02-17T18:18:54.389133Z] [fv-az1910-428.atjgolet2xaebjmaknva5kv5uc.ex.internal.cloudapp.net] [130000_1] [WorkflowRunner] [ERROR] [CallGenome+callGenomeSegment_chromId_000_chr21_0003] [taskWrapper-stderr] [2025-02-17T18:18:50.971839Z] [fv-az1910-428.atjgolet2xaebjmaknva5kv5uc.ex.internal.cloudapp.net] [130000_1] [pyflowTaskWrapper:CallGenome+callGenomeSegment_chromId_000_chr21_0003] [wrapperSignal] taskStart
  [2025-02-17T18:18:54.389143Z] [fv-az1910-428.atjgolet2xaebjmaknva5kv5uc.ex.internal.cloudapp.net] [130000_1] [WorkflowRunner] [ERROR] [CallGenome+callGenomeSegment_chromId_000_chr21_0003] [taskWrapper-stderr] [2025-02-17T18:18:51.152755Z] [fv-az1910-428.atjgolet2xaebjmaknva5kv5uc.ex.internal.cloudapp.net] [130000_1] [pyflowTaskWrapper:CallGenome+callGenomeSegment_chromId_000_chr21_0003] [wrapperSignal] taskExitCode -11
  [2025-02-17T18:18:54.389154Z] [fv-az1910-428.atjgolet2xaebjmaknva5kv5uc.ex.internal.cloudapp.net] [130000_1] [WorkflowRunner] [ERROR] [CallGenome+callGenomeSegment_chromId_000_chr21_0003] [taskWrapper-stderr] [2025-02-17T18:18:51.153942Z] [fv-az1910-428.atjgolet2xaebjmaknva5kv5uc.ex.internal.cloudapp.net] [130000_1] [pyflowTaskWrapper:CallGenome+callGenomeSegment_chromId_000_chr21_0003] [wrapperSignal] taskStderrTail 1
  [2025-02-17T18:18:54.389166Z] [fv-az1910-428.atjgolet2xaebjmaknva5kv5uc.ex.internal.cloudapp.net] [130000_1] [WorkflowRunner] [ERROR] [CallGenome+callGenomeSegment_chromId_000_chr21_0003] [taskWrapper-stderr] Last 0 stderr lines from task (of 0 total lines):
  [2025-02-17T18:18:54.389176Z] [fv-az1910-428.atjgolet2xaebjmaknva5kv5uc.ex.internal.cloudapp.net] [130000_1] [WorkflowRunner] [ERROR] Failed to complete command task: 'CallGenome+callGenomeSegment_chromId_000_chr21_0000' launched from sub-workflow 'CallGenome', error code: 1, command: '/home/runner/work/sarek/sarek/~/tests/a25df8ae6d08704eae218f7a45a79e60/work/conda/env-45ec49f1ad56587b-438a505d7b44a08705c858f9ad6e02ce/share/strelka-2.9.10-2/libexec/strelka2 --region chr21:1-11677496 --ref genome.fasta --max-indel-size 49 --min-mapping-quality 20 --somatic-snv-rate 0.0001 --shared-site-error-rate 0.0000000005 --shared-site-error-strand-bias-fraction 0.0 --somatic-indel-rate 0.000001 --shared-indel-error-factor 2.2 --tier2-min-mapping-quality 0 --strelka-snv-max-filtered-basecall-frac 0.4 --strelka-snv-max-spanning-deletion-frac 0.75 --strelka-snv-min-qss-ref 15 --strelka-indel-max-window-filtered-basecall-frac 0.3 --strelka-indel-min-qsi-ref 40 --ssnv-contam-tolerance 0.15 --indel-contam-tolerance 0.15 --somatic-snv-scoring-model-file /home/runner/work/sarek/sarek/~/tests/a25df8ae6d08704eae218f7a45a79e60/work/conda/env-45ec49f1ad56587b-438a505d7b44a08705c858f9ad6e02ce/share/strelka-2.9.10-2/share/config/somaticSNVScoringModels.json --somatic-indel-scoring-model-file /home/runner/work/sarek/sarek/~/tests/a25df8ae6d08704eae218f7a45a79e60/work/conda/env-45ec49f1ad56587b-438a505d7b44a08705c858f9ad6e02ce/share/strelka-2.9.10-2/share/config/somaticIndelScoringModels.json --normal-align-file test.paired_end.recalibrated.sorted.cram --tumor-align-file test2.paired_end.recalibrated.sorted.cram --somatic-snv-file strelka/workspace/genomeSegment.tmpdir/somatic.snvs.unfiltered.chromId_000_chr21_0000.vcf --somatic-indel-file strelka/workspace/genomeSegment.tmpdir/somatic.indels.unfiltered.chromId_000_chr21_0000.vcf --stats-file strelka/workspace/genomeSegment.tmpdir/runStats.chromId_000_chr21_0000.xml --strelka-chrom-depth-file strelka/workspace/chromDepth.tsv --strelka-max-depth-factor 3.0'
  [2025-02-17T18:18:54.389200Z] [fv-az1910-428.atjgolet2xaebjmaknva5kv5uc.ex.internal.cloudapp.net] [130000_1] [WorkflowRunner] [ERROR] [CallGenome+callGenomeSegment_chromId_000_chr21_0000] Error Message:
  [2025-02-17T18:18:54.389209Z] [fv-az1910-428.atjgolet2xaebjmaknva5kv5uc.ex.internal.cloudapp.net] [130000_1] [WorkflowRunner] [ERROR] [CallGenome+callGenomeSegment_chromId_000_chr21_0000] Anomalous task wrapper stderr output. Wrapper signal file: 'strelka/workspace/pyflow.data/logs/tmp/taskWrapperLogs/000/008/pyflowTaskWrapper.signal.txt'
  [2025-02-17T18:18:54.389220Z] [fv-az1910-428.atjgolet2xaebjmaknva5kv5uc.ex.internal.cloudapp.net] [130000_1] [WorkflowRunner] [ERROR] [CallGenome+callGenomeSegment_chromId_000_chr21_0000] Logging 5 line(s) of task wrapper log output below:
  [2025-02-17T18:18:54.389229Z] [fv-az1910-428.atjgolet2xaebjmaknva5kv5uc.ex.internal.cloudapp.net] [130000_1] [WorkflowRunner] [ERROR] [CallGenome+callGenomeSegment_chromId_000_chr21_0000] [taskWrapper-stderr] [2025-02-17T18:18:50.940270Z] [fv-az1910-428.atjgolet2xaebjmaknva5kv5uc.ex.internal.cloudapp.net] [130000_1] [pyflowTaskWrapper:CallGenome+callGenomeSegment_chromId_000_chr21_0000] [wrapperSignal] wrapperStart
  [2025-02-17T18:18:54.389242Z] [fv-az1910-428.atjgolet2xaebjmaknva5kv5uc.ex.internal.cloudapp.net] [130000_1] [WorkflowRunner] [ERROR] [CallGenome+callGenomeSegment_chromId_000_chr21_0000] [taskWrapper-stderr] [2025-02-17T18:18:50.953123Z] [fv-az1910-428.atjgolet2xaebjmaknva5kv5uc.ex.internal.cloudapp.net] [130000_1] [pyflowTaskWrapper:CallGenome+callGenomeSegment_chromId_000_chr21_0000] [wrapperSignal] taskStart
  [2025-02-17T18:18:54.389252Z] [fv-az1910-428.atjgolet2xaebjmaknva5kv5uc.ex.internal.cloudapp.net] [130000_1] [WorkflowRunner] [ERROR] [CallGenome+callGenomeSegment_chromId_000_chr21_0000] [taskWrapper-stderr] [2025-02-17T18:18:51.201809Z] [fv-az1910-428.atjgolet2xaebjmaknva5kv5uc.ex.internal.cloudapp.net] [130000_1] [pyflowTaskWrapper:CallGenome+callGenomeSegment_chromId_000_chr21_0000] [wrapperSignal] taskExitCode -11
  [2025-02-17T18:18:54.389267Z] [fv-az1910-428.atjgolet2xaebjmaknva5kv5uc.ex.internal.cloudapp.net] [130000_1] [WorkflowRunner] [ERROR] [CallGenome+callGenomeSegment_chromId_000_chr21_0000] [taskWrapper-stderr] [2025-02-17T18:18:51.205391Z] [fv-az1910-428.atjgolet2xaebjmaknva5kv5uc.ex.internal.cloudapp.net] [130000_1] [pyflowTaskWrapper:CallGenome+callGenomeSegment_chromId_000_chr21_0000] [wrapperSignal] taskStderrTail 1
  [2025-02-17T18:18:54.389278Z] [fv-az1910-428.atjgolet2xaebjmaknva5kv5uc.ex.internal.cloudapp.net] [130000_1] [WorkflowRunner] [ERROR] [CallGenome+callGenomeSegment_chromId_000_chr21_0000] [taskWrapper-stderr] Last 0 stderr lines from task (of 0 total lines):

Work dir:
  /home/runner/work/sarek/sarek/~/tests/a25df8ae6d08704eae218f7a45a79e60/work/91/913b0f5c87a188165dd7b3d6756fd7

Tip: you can replicate the issue by changing to the process work dir and entering the command `bash .command.run`

 -- Check '/home/runner/work/sarek/sarek/~/tests/a25df8ae6d08704eae218f7a45a79e60/meta/nextflow.log' file for details
[d0/3c9952] Submitted process > NFCORE_SAREK:SAREK:VCF_QC_BCFTOOLS_VCFTOOLS:VCFTOOLS_SUMMARY (sample3)
ERROR ~ Pipeline failed. Please refer to troubleshooting docs: https://nf-co.re/docs/usage/troubleshooting

 -- Check '/home/runner/work/sarek/sarek/~/tests/a25df8ae6d08704eae218f7a45a79e60/meta/nextflow.log' file for details
-[nf-core/sarek] Pipeline completed with errors-
WARN: Killing running tasks (3)
Creating env using conda: /home/runner/work/sarek/sarek/./workflows/sarek/../../modules/nf-core/multiqc/environment.yml [cache /home/runner/work/sarek/sarek/~/tests/a25df8ae6d08704eae218f7a45a79e60/work/conda/env-7da4088df3b01749-eec4e05336245ea50db6412788f8c4da]
Nextflow stderr: