Skip to content

Bump test.camel-quarkus-3-0.camel-version from 3.18.6 to 4.10.0

quarkus-bot / Build summary for 1f75f23ec84e6ac097cf6be59875112505780b5a completed Feb 11, 2025 in 0s

Build summary for 1f75f23ec84e6ac097cf6be59875112505780b5a

Failing Jobs - Building 1f75f23 - Back to Pull request

Status Name Step Failures Logs Raw logs Build scan
βœ– Build on ubuntu-latest Build with Maven Failures Logs Raw logs 🚧

Details

Test Failures

βš™οΈ Build on ubuntu-latest #

- Failing: recipes-tests 

πŸ“¦ recipes-tests

# Tests:    181
+ Success:  172
- Failures: 3
- Errors:   0
! Skipped:  6

βœ– io.quarkus.updates.camel.CamelUpdate45Test.testSearch line 26 - Source on GitHub - πŸ …

org.opentest4j.AssertionFailedError: 
[Unexpected result in "SearchTest.java":
diff --git a/SearchTest.java b/SearchTest.java
index 1e9de7a..d2044cc 100644
--- a/SearchTest.java
+++ b/SearchTest.java
@@ -1,7 +1,7 @@ 
 public class SearchTest {

βœ– io.quarkus.updates.camel.CamelUpdate49Test.testApiChanges - Source on GitHub - πŸ …

java.lang.AssertionError: Recipe was expected to make a change but made no changes.
	at org.openrewrite.test.LargeSourceSetCheckingExpectedCycles.afterCycle(LargeSourceSetCheckingExpectedCycles.java:119)
	at org.openrewrite.RecipeScheduler.runRecipeCycles(RecipeScheduler.java:98)
	at org.openrewrite.RecipeScheduler.scheduleRun(RecipeScheduler.java:41)
	at org.openrewrite.Recipe.run(Recipe.java:378)
	at org.openrewrite.test.RewriteTest.rewriteRun(RewriteTest.java:373)
	at org.openrewrite.test.RewriteTest.rewriteRun(RewriteTest.java:129)
	at org.openrewrite.test.RewriteTest.rewriteRun(RewriteTest.java:124)

βœ– io.quarkus.updates.camel.CamelUpdate49Test.testDebezium line 32 - Source on GitHub - πŸ …

java.lang.AssertionError: Recipe was expected to make a change but made no changes.
	at org.openrewrite.test.LargeSourceSetCheckingExpectedCycles.afterCycle(LargeSourceSetCheckingExpectedCycles.java:119)
	at org.openrewrite.RecipeScheduler.runRecipeCycles(RecipeScheduler.java:98)
	at org.openrewrite.RecipeScheduler.scheduleRun(RecipeScheduler.java:41)
	at org.openrewrite.Recipe.run(Recipe.java:378)
	at org.openrewrite.test.RewriteTest.rewriteRun(RewriteTest.java:373)
	at org.openrewrite.test.RewriteTest.rewriteRun(RewriteTest.java:129)
	at org.openrewrite.test.RewriteTest.rewriteRun(RewriteTest.java:124)

Annotations

Check failure on line 26 in recipes-tests/src/test/java/io/quarkus/updates/camel/CamelUpdate45Test.java

See this annotation in the file changed.

@quarkus-bot quarkus-bot / Build summary for 1f75f23ec84e6ac097cf6be59875112505780b5a

Build on ubuntu-latest

org.opentest4j.AssertionFailedError: 
[Unexpected result in "SearchTest.java":
diff --git a/SearchTest.java b/SearchTest.java
Raw output
org.opentest4j.AssertionFailedError: 
[Unexpected result in "SearchTest.java":
diff --git a/SearchTest.java b/SearchTest.java
index 1e9de7a..d2044cc 100644
--- a/SearchTest.java
+++ b/SearchTest.java
@@ -1,7 +1,7 @@ 
 public class SearchTest {
      public void test() {
 
-         org.apache.camel.component.es.aggregation.ElasticsearchBulkRequestAggregationStrategy elasticAggregationStrategy = null;
+         org.apache.camel.component.es.aggregation.BulkRequestAggregationStrategy elasticAggregationStrategy = null;
          org.apache.camel.component.opensearch.aggregation.OpensearchBulkRequestAggregationStrategy openAggregationStrategy = null;
      }
 }
\ No newline at end of file
] 
expected: 
  "public class SearchTest {
       public void test() {
  
           org.apache.camel.component.es.aggregation.ElasticsearchBulkRequestAggregationStrategy elasticAggregationStrategy = null;
           org.apache.camel.component.opensearch.aggregation.OpensearchBulkRequestAggregationStrategy openAggregationStrategy = null;
       }
  }"
 but was: 
  "public class SearchTest {
       public void test() {
  
           org.apache.camel.component.es.aggregation.BulkRequestAggregationStrategy elasticAggregationStrategy = null;
           org.apache.camel.component.opensearch.aggregation.OpensearchBulkRequestAggregationStrategy openAggregationStrategy = null;
       }
  }"
	at org.openrewrite.test.RewriteTest.assertContentEquals(RewriteTest.java:617)
	at org.openrewrite.test.RewriteTest.rewriteRun(RewriteTest.java:506)
	at org.openrewrite.test.RewriteTest.rewriteRun(RewriteTest.java:129)
	at org.openrewrite.test.RewriteTest.rewriteRun(RewriteTest.java:124)
	at io.quarkus.updates.camel.CamelUpdate45Test.testSearch(CamelUpdate45Test.java:26)
	at java.base/java.lang.reflect.Method.invoke(Method.java:569)
	at java.base/java.util.ArrayList.forEach(ArrayList.java:1511)
	at java.base/java.util.ArrayList.forEach(ArrayList.java:1511)

Check failure on line 1 in recipes-tests/src/test/java/io/quarkus/updates/camel/CamelUpdate49Test.java

See this annotation in the file changed.

@quarkus-bot quarkus-bot / Build summary for 1f75f23ec84e6ac097cf6be59875112505780b5a

Build on ubuntu-latest

java.lang.AssertionError: Recipe was expected to make a change but made no changes.
	at org.openrewrite.test.LargeSourceSetCheckingExpectedCycles.afterCycle(LargeSourceSetCheckingExpectedCycles.java:119)
	at org.openrewrite.RecipeScheduler.runRecipeCycles(RecipeScheduler.java:98)
Raw output
java.lang.AssertionError: Recipe was expected to make a change but made no changes.
	at org.openrewrite.test.LargeSourceSetCheckingExpectedCycles.afterCycle(LargeSourceSetCheckingExpectedCycles.java:119)
	at org.openrewrite.RecipeScheduler.runRecipeCycles(RecipeScheduler.java:98)
	at org.openrewrite.RecipeScheduler.scheduleRun(RecipeScheduler.java:41)
	at org.openrewrite.Recipe.run(Recipe.java:378)
	at org.openrewrite.test.RewriteTest.rewriteRun(RewriteTest.java:373)
	at org.openrewrite.test.RewriteTest.rewriteRun(RewriteTest.java:129)
	at org.openrewrite.test.RewriteTest.rewriteRun(RewriteTest.java:124)
	at org.apache.camel.upgrade.CamelUpdate49Test.testApiChanges(CamelUpdate49Test.java:45)
	at java.base/java.lang.reflect.Method.invoke(Method.java:569)
	at java.base/java.util.ArrayList.forEach(ArrayList.java:1511)
	at java.base/java.util.ArrayList.forEach(ArrayList.java:1511)

Check failure on line 32 in recipes-tests/src/test/java/io/quarkus/updates/camel/CamelUpdate49Test.java

See this annotation in the file changed.

@quarkus-bot quarkus-bot / Build summary for 1f75f23ec84e6ac097cf6be59875112505780b5a

Build on ubuntu-latest

java.lang.AssertionError: Recipe was expected to make a change but made no changes.
	at org.openrewrite.test.LargeSourceSetCheckingExpectedCycles.afterCycle(LargeSourceSetCheckingExpectedCycles.java:119)
	at org.openrewrite.RecipeScheduler.runRecipeCycles(RecipeScheduler.java:98)
Raw output
java.lang.AssertionError: Recipe was expected to make a change but made no changes.
	at org.openrewrite.test.LargeSourceSetCheckingExpectedCycles.afterCycle(LargeSourceSetCheckingExpectedCycles.java:119)
	at org.openrewrite.RecipeScheduler.runRecipeCycles(RecipeScheduler.java:98)
	at org.openrewrite.RecipeScheduler.scheduleRun(RecipeScheduler.java:41)
	at org.openrewrite.Recipe.run(Recipe.java:378)
	at org.openrewrite.test.RewriteTest.rewriteRun(RewriteTest.java:373)
	at org.openrewrite.test.RewriteTest.rewriteRun(RewriteTest.java:129)
	at org.openrewrite.test.RewriteTest.rewriteRun(RewriteTest.java:124)
	at io.quarkus.updates.camel.CamelUpdate49Test.testDebezium(CamelUpdate49Test.java:32)
	at java.base/java.lang.reflect.Method.invoke(Method.java:569)
	at java.base/java.util.ArrayList.forEach(ArrayList.java:1511)
	at java.base/java.util.ArrayList.forEach(ArrayList.java:1511)